{"text_format":"1","workbook":"xlsx","n_sheets":8,"sheets":["Finish Times","Finish Times (2)","Fleet 1","Fleet 2","Fleet 3","Fleet 4","Fleet 1 and 2 Combo","Fleet 3 and 4 Combo"],"not_rendered":{"charts":0,"images":1,"macros":1,"external_links":0,"defined_names":6,"comments":4,"pivot_tables":0},"unopened":[],"bounds":{"document_bytes":16777216,"sheet_cells":100000,"rows_first":2000,"rows_last":500,"rows_between":2000,"halvings":0,"cell_chars":16384,"cell_head_chars":4096},"cells_cut":0,"cells_raw":0,"read":"whole","date_system":"1900"}

{"sheet":"Finish Times","index":0,"n_rows":40,"n_cols":11,"rows_kept":40,"cut":false,"hidden":false,"merged":[]}
[]
[]
[]
["Minutes  ------->",0,"FLEET 1",null,null,null,null,null,"2017-09-09","<----Enter Race Date"]
["After",{"$f":"B4","v":0},"FLEET 2",null,null,null,null,null,"2017 Fall Series Race #2","<----Enter Race Description (EG:  2017 Spring Series Race #4)"]
["First ------------->",5,"FLEET 3",null,null,null,null,null,"Maloney, Tunnell","<----Enter Race Committee Name"]
["Start",{"$f":"B6","v":5},"FLEET 4",null,null,null,null,null,"Windward / Leeward Course 1X for Fleets I and II, 1X for Fleets III and IV ",null,"<---Replace with description of the day's racing conditions"]
[null,null,null,null,null,"Finish Time"]
["BOAT NAME","FLEET","BOAT","SAIL #","SKIPPER","MINUTES","SECONDS"]
["Alarming",4,"S-2 9.2",505,"Oginz",47,33,1]
{"$rows_left_out":31}
{"sheet":"Finish Times (2)","index":1,"n_rows":39,"n_cols":7,"rows_kept":39,"cut":false,"hidden":true,"merged":[]}
[]
[]
[]
["MUST",null,"FLEET 1"]
["BE",null,"FLEET 2"]
["IN ALPHA",null,"FLEET 3"]
["ORDER",null,"FLEET 4"]
[null,null,null,null,null,"Finish Time"]
["BOAT NAME","FLEET","BOAT","SAIL #","SKIPPER","MINUTES","SECONDS"]
["Bandit",1,"J/24",2792,"Cliborne"]
{"$rows_left_out":30}
{"sheet":"Fleet 1","index":2,"n_rows":30,"n_cols":37,"rows_kept":30,"cut":false,"hidden":false,"merged":[[4,0,4,14],[6,0,6,14],[7,6,7,7],[7,8,7,9],[7,10,7,11],[5,5,5,8]]}
["Control Z to run macro",null,null,null,null,null,null,null,null,null,null,null,null,null,null,null,null,null,1,null,null,null,null,null,"Winner"]
[null,null,null,null,null,null,null,null,null,null,null,null,null,null,null,null,null,null,null,null,null,null,null,null,{"$f":"MIN(N10:N24)","v":20.140186915887853}]
[{"$f":"'Finish Times'!B4","v":0},"<-----Minutes after first start"]
[]
["Blackwater Yacht Racing Association - Race Results - Fleet 1",null,null,null,null,null,null,null,null,null,null,null,null,null,null,null,null,null,null,null,null,null,null,null,null,"Test"]
[null,null,null,"Date: ",{"$f":"'Finish Times'!I4","v":"2017-09-09"},{"$f":"'Finish Times'!I5","v":"2017 Fall Series Race #2"},null,null,null,null,{"$f":"CONCATENATE(\"RC:\",\" \",'Finish Times'!I6)","v":"RC: Maloney, Tunnell"},null,null,null,null,null,null,null,null,null,null,null,null,null,"new tcf =","should ="]
[{"$f":"'Finish Times'!I7","v":"Windward / Leeward Course 1X for Fleets I and II, 1X for Fleets III and IV "},null,null,null,null,null,null,null,null,null,null,null,null,null,null,"Time","Time","Approx",null,"Finish Calculations",null,null,null,null,"Winner Adj Time","Winner Adj Time",null,null,"# of Boats"]
[null,null,null,null,null,null,"Handicap",null,"TCF",null,"Finish Time",null,"Calc(1)","Adj.(2)",null,"Behind","Behind","H'cap",null,"S for Spin",null,null,null,null,"/observed",null,null,null,{"$f":"MAX(AC10:AC24)","v":6}]
["Skipper","Boat Name","Initials","Guest?","Boat","Sail #","Spin*","Non-Spin*","Spin*","Non-Spin*","Min.","Sec.","Min.dd","Time","Place","Winner","Boat Ahead","to win",null,"N for non"]
["Cliborne","Bandit",null,null,"J/24",2792,170,{"$f":"IFERROR(G10+15,\"\")","v":185},{"$f":"IF(T10 = \"s\",1000/(900+G10),\"\")","v":0.93457943925233644},{"$f":"IF(T10 =\"n\",1000/(900+H10),\"\")","v":""},{"$f":"IF($AK10>0,(VLOOKUP($B10,'Finish Times'!$A$10:$G$40,6,FALSE)),\"\")","v":24},{"$f":"IF($AK10>0,(VLOOKUP($B10,'Finish Times'!$A$10:$G$40,7,FALSE)),\"\")","v":42},{"$f":"IF(AK10>0,(K10+L10/60)-A$3,\" \")","v":24.7},{"$f":"IFERROR(U10,\" \")","v":23.084112149532711},3,{"$f":"IFERROR(N10-$Y$2,\"\")","v":2.9439252336448583},2.3052959501557631,{"$f":"IFERROR(ROUND((1000/Y10)-900,0),\"\")","v":326},null,"s",{"$f":"IFERROR(IF(M10>0,IF(T10=\"s\",M10*I10,0)+IF(T10=\"n\",M10*J10,0),\" \"),\"\")","v":23.084112149532711},{"$f":"IFERROR(RANK(N10,$N$10:$N$24,1),\"\")","v":3},null,null,{"$f":"IFERROR($Y$2/M10,\"\")","v":0.81539218282946779},{"$f":"IFERROR(M10*Y10,\"\")","v":20.140186915887853},null,1,3,2.9439252336448583,2.3052959501557631,null,null,55,39,null,{"$f":"(VLOOKUP($B10,'Finish Times'!$A$10:$G$40,6,FALSE))","v":24}]
{"$rows_left_out":21}
{"sheet":"Fleet 2","index":3,"n_rows":28,"n_cols":37,"rows_kept":28,"cut":false,"hidden":false,"merged":[[4,0,4,14],[6,0,6,14],[7,6,7,7],[7,8,7,9],[7,10,7,11],[5,5,5,8]]}
[null,null,null,null,null,null,null,null,null,null,null,null,null,null,null,null,null,null,2,null,null,null,null,null,"Winner"]
[null,null,null,null,null,null,null,null,null,null,null,null,null,null,null,null,null,null,null,null,null,null,null,null,{"$f":"MIN(N10:N22)","v":24.345395704619005}]
[{"$f":"'Finish Times'!B5","v":0},"<-----Minutes after first start"]
[]
["Blackwater Yacht Racing Association - Race Results - Fleet 2",null,null,null,null,null,null,null,null,null,null,null,null,null,null,null,null,null,2,null,null,null,null,null,null,"Test"]
[null,null,null,"Date:",{"$f":"'Finish Times'!I4","v":"2017-09-09"},{"$f":"'Finish Times'!I5","v":"2017 Fall Series Race #2"},null,null,null,null,{"$f":"CONCATENATE(\"RC:\",\" \",'Finish Times'!I6)","v":"RC: Maloney, Tunnell"},null,null,null,null,null,null,null,null,null,null,null,null,null,"new tcf =","should ="]
[{"$f":"'Finish Times'!I7","v":"Windward / Leeward Course 1X for Fleets I and II, 1X for Fleets III and IV "},null,null,null,null,null,null,null,null,null,null,null,null,null,null,"Time","Time","Approx",null,"Finish Calculations",null,null,null,null,"Winner Adj Time","Winner Adj Time",null,null,"# of Boats"]
[null,null,null,null,null,null,"Handicap",null,"TCF",null,"Finish Time",null,"Calc(1)","Adj.(2)",null,"Behind","Behind","H'cap",null,"S for Spin",null,null,null,null,"/observed",null,null,null,{"$f":"MAX(AC10:AC22)","v":3}]
["Skipper","Boat Name","Initials","Guest?","Boat","Sail #","Spin*","Non-Spin*","Spin*","Non-Spin*","Min.","Sec.","Min.dd","Time","Place","Winner","Boat Ahead","to win",null,"N for non"]
["Theis","Gotcha",null,null,"S-2 6.7",75,208,{"$f":"IFERROR(G10+15,\"\")","v":223},{"$f":"IF(T10 = \"s\",1000/(900+G10),\"\")","v":0.90252707581227432},{"$f":"IF(T10 =\"n\",1000/(900+H10),\"\")","v":""},{"$f":"IF(AK10>0,VLOOKUP($B10,'Finish Times'!$A$10:$G$40,6,FALSE),\"\")","v":""},{"$f":"IF(AK10>0,VLOOKUP($B10,'Finish Times'!$A$10:$G$40,7,FALSE),\"\")","v":""},{"$f":"IF(AK10>0,(K10+L10/60)-A$3,\" \")","v":" "},{"$f":"IFERROR(U10,\" \")","v":""},{"$f":"IFERROR(V10,\" \")","v":""},{"$f":"IFERROR(N10-$Y$2,\"\")","v":""},"",{"$f":"IFERROR(ROUND((1000/Y10)-900,0),\"\")","v":""},null,"s",{"$f":"IFERROR(IF(M10>0,IF(T10=\"s\",M10*I10,0)+IF(T10=\"n\",M10*J10,0),\" \"),\"\")","v":""},{"$f":"IFERROR(RANK(N10,$N$10:$N$22,1),\"\")","v":""},null,null,{"$f":"IFERROR($Y$2/M10,\"\")","v":""},{"$f":"IFERROR(M10*Y10,\"\")","v":""},null,1,"","","",null,null,55,39,null,{"$f":"VLOOKUP($B10,'Finish Times'!$A$10:$G$40,6,FALSE)","v":0}]
{"$rows_left_out":19}
{"sheet":"Fleet 3","index":4,"n_rows":30,"n_cols":37,"rows_kept":30,"cut":false,"hidden":false,"merged":[[4,0,4,14],[6,0,6,14],[7,6,7,7],[7,8,7,9],[7,10,7,11],[5,5,5,8]]}
[null,null,null,null,null,null,null,null,null,null,null,null,null,null,null,null,null,null,3,null,null,null,null,null,"Winner"]
[null,null,null,null,null,null,null,null,null,null,null,null,null,null,null,null,null,null,null,null,null,null,null,null,{"$f":"MIN(N10:N24)","v":34.211283822682788}]
[{"$f":"'Finish Times'!B6","v":5},"<-----Minutes after first start"]
[]
["Blackwater Yacht Racing Association - Race Results - Fleet 3",null,null,null,null,null,null,null,null,null,null,null,null,null,null,null,null,null,null,null,null,null,null,null,null,"Test"]
[null,null,null,null,{"$f":"'Finish Times'!I4","v":"2017-09-09"},{"$f":"'Finish Times'!I5","v":"2017 Fall Series Race #2"},null,null,null,null,{"$f":"CONCATENATE(\"RC:\",\" \",'Finish Times'!I6)","v":"RC: Maloney, Tunnell"},null,null,null,null,null,null,null,null,null,null,null,null,null,"new tcf =","should ="]
[{"$f":"'Finish Times'!I7","v":"Windward / Leeward Course 1X for Fleets I and II, 1X for Fleets III and IV "},null,null,null,null,null,null,null,null,null,null,null,null,null,null,"Time","Time","Approx",null,"Finish Calculations",null,null,null,null,"Winner Adj Time","Winner Adj Time",null,null,"# of Boats"]
[null,null,null,null,null,null,"Handicap",null,"TCF",null,"Finish Time",null,"Calc(1)","Adj.(2)",null,"Behind","Behind","H'cap",null,"S for Spin",null,null,null,null,"/observed",null,null,null,{"$f":"MAX(AC10:AC24)","v":3}]
["Skipper","Boat Name","Initials","Guest?","Boat","Sail #","Spin*","Non-Spin*","Spin*","Non-Spin*","Min.","Sec.","Min.dd","Time","Place","Winner","Boat Ahead","to win",null,"N for non"]
["Perdue","Miss Virginia",null,null,"Hunter 23.5",1309,243,{"$f":"IFERROR(G10+15,\"\")","v":258},{"$f":"IF(T10 = \"s\",1000/(900+G10),\"\")","v":0.87489063867016625},{"$f":"IF(T10 =\"n\",1000/(900+H10),\"\")","v":""},{"$f":"IF(AK10>0,VLOOKUP($B10,'Finish Times'!$A$10:$G$40,6,FALSE),\" \")","v":" "},{"$f":"IF(AK10>0,VLOOKUP($B10,'Finish Times'!$A$10:$G$40,7,FALSE),\" \")","v":" "},{"$f":"IF(AK10>0,(K10+L10/60)-A$3,\" \")","v":" "},{"$f":"IFERROR(U10,\" \")","v":""},"",{"$f":"IFERROR(N10-$Y$2,\"\")","v":""},"",{"$f":"IFERROR(ROUND((1000/Y10)-900,0),\"\")","v":""},null,"s",{"$f":"IFERROR(IF(M10>0,IF(T10=\"s\",M10*I10,0)+IF(T10=\"n\",M10*J10,0),\" \"),\"\")","v":""},{"$f":"IFERROR(RANK(N10,$N$10:$N$24,1),\"\")","v":""},null,null,{"$f":"IFERROR($Y$2/M10,\"\")","v":""},{"$f":"IFERROR(M10*Y10,\"\")","v":""},null,1,"","","",null,null,55,39,null,{"$f":"VLOOKUP($B10,'Finish Times'!$A$10:$G$40,6,FALSE)","v":0}]
{"$rows_left_out":21}
{"sheet":"Fleet 4","index":5,"n_rows":29,"n_cols":37,"rows_kept":29,"cut":false,"hidden":false,"merged":[[4,0,4,14],[6,0,6,14],[7,6,7,7],[7,8,7,9],[7,10,7,11],[5,5,5,8]]}
[null,null,null,null,null,null,null,null,null,null,null,null,null,null,null,null,null,null,4,null,null,null,null,null,"Winner"]
[null,null,null,null,null,null,null,null,null,null,null,null,null,null,null,null,null,null,null,null,null,null,null,null,{"$f":"MIN(N10:N23)","v":38.503155996393147}]
[{"$f":"'Finish Times'!B7","v":5},"<-----Minutes after first start"]
[]
["Blackwater Yacht Racing Association - Race Results - Fleet 4",null,null,null,null,null,null,null,null,null,null,null,null,null,null,null,null,null,null,null,null,null,null,null,null,"Test"]
[null,null,null,"Date:",{"$f":"'Finish Times'!I4","v":"2017-09-09"},{"$f":"'Finish Times'!I5","v":"2017 Fall Series Race #2"},null,null,null,null,{"$f":"CONCATENATE(\"RC:\",\" \",'Finish Times'!I6)","v":"RC: Maloney, Tunnell"},null,null,null,null,null,null,null,null,null,null,null,null,null,"new tcf =","should ="]
[{"$f":"'Finish Times'!I7","v":"Windward / Leeward Course 1X for Fleets I and II, 1X for Fleets III and IV "},null,null,null,null,null,null,null,null,null,null,null,null,null,null,"Time","Time","Approx",null,"Finish Calculations",null,null,null,null,"Winner Adj Time","Winner Adj Time",null,null,"# of Boats"]
[null,null,null,null,null,null,"Handicap",null,"TCF",null,"Finish Time",null,"Calc(1)","Adj.(2)",null,"Behind","Behind","H'cap",null,"S for Spin",null,null,null,null,"/observed",null,null,null,{"$f":"MAX(AC10:AC23)","v":3}]
["Skipper","Boat Name","Initials","Guest?","Boat","Sail #","Spin*","Non-Spin*","Spin*","Non-Spin*","Min.","Sec.","Min.dd","Time","Place","Winner","Boat Ahead","to win",null,"N for non"]
["DeMestro","Little Wing",null,null,"Beneteau 29",485,168,{"$f":"IFERROR(G10+15,\"\")","v":183},{"$f":"IF(T10 = \"s\",1000/(900+G10),\"\")","v":""},{"$f":"IF(T10 =\"n\",1000/(900+H10),\"\")","v":0.92336103416435822},{"$f":"IF(AK10>0,VLOOKUP($B10,'Finish Times'!$A$10:$G$40,6,FALSE),\" \")","v":" "},{"$f":"IF(AK10>0,VLOOKUP($B10,'Finish Times'!$A$10:$G$40,7,FALSE),\" \")","v":" "},{"$f":"IF(AK10>0,(K10+L10/60)-A$3,\" \")","v":" "},{"$f":"IFERROR(U10,\" \")","v":""},"",{"$f":"IFERROR(N10-$Y$2,\"\")","v":""},"",{"$f":"IFERROR(ROUND((1000/Y10)-900,0),\"\")","v":""},null,"n",{"$f":"IFERROR(IF(M10>0,IF(T10=\"s\",M10*I10,0)+IF(T10=\"n\",M10*J10,0),\" \"),\"\")","v":""},{"$f":"IFERROR(RANK(N10,$N$10:$N$23,1),\"\")","v":""},null,null,{"$f":"IFERROR($Y$2/M10,\"\")","v":""},{"$f":"IFERROR(M10*Y10,\"\")","v":""},null,1,"","","",null,null,55,39,null,{"$f":"VLOOKUP($B10,'Finish Times'!$A$10:$G$40,6,FALSE)","v":0}]
{"$rows_left_out":20}
{"sheet":"Fleet 1 and 2 Combo","index":6,"n_rows":33,"n_cols":37,"rows_kept":33,"cut":false,"hidden":false,"merged":[[4,0,4,14],[6,0,6,14],[7,6,7,7],[7,8,7,9],[7,10,7,11],[5,5,5,8]]}
["Control Z to run macro",null,null,null,null,null,null,null,null,null,null,null,null,null,null,null,null,null,5,null,null,null,null,null,"Winner"]
[null,null,null,null,null,null,null,null,null,null,null,null,null,null,null,null,null,null,null,null,null,null,null,null,{"$f":"MIN(N10:N27)","v":20.140186915887853}]
[{"$f":"'Finish Times'!B4","v":0},"<-----Minutes after first start"]
[]
["Blackwater Yacht Racing Association - Race Results Fleets I & 2",null,null,null,null,null,null,null,null,null,null,null,null,null,null,null,null,null,null,null,null,null,null,null,null,"Test"]
[null,null,null,"Date:",{"$f":"'Finish Times'!I4","v":"2017-09-09"},{"$f":"'Finish Times'!I5","v":"2017 Fall Series Race #2"},null,null,null,null,{"$f":"CONCATENATE(\"RC:\",\" \",'Finish Times'!I6)","v":"RC: Maloney, Tunnell"},null,null,null,null,null,null,null,null,null,null,null,null,null,"new tcf =","should ="]
[{"$f":"'Finish Times'!I7","v":"Windward / Leeward Course 1X for Fleets I and II, 1X for Fleets III and IV "},null,null,null,null,null,null,null,null,null,null,null,null,null,null,"Time","Time","Approx",null,"Finish Calculations",null,null,null,null,"Winner Adj Time","Winner Adj Time",null,null,"# of Boats"]
[null,null,null,null,null,null,"Handicap",null,"TCF",null,"Finish Time",null,"Calc(1)","Adj.(2)",null,"Behind","Behind","H'cap",null,"S for Spin",null,null,null,null,"/observed",null,null,null,{"$f":"MAX(AC10:AC27)","v":9}]
["Skipper","Boat Name","Initials","Guest?","Boat","Sail #","Spin*","Non-Spin*","Spin*","Non-Spin*","Min.","Sec.","Min.dd","Time","Place","Winner","Boat Ahead","to win",null,"N for non"]
["Cliborne","Bandit",null,null,"J/24",2792,170,{"$f":"IFERROR(G10+15,\"\")","v":185},{"$f":"IF(T10 = \"s\",1000/(900+G10),\"\")","v":0.93457943925233644},{"$f":"IF(T10 =\"n\",1000/(900+H10),\"\")","v":""},{"$f":"IF($AK10>0,(VLOOKUP($B10,'Finish Times'!$A$10:$G$40,6,FALSE)),\"\")","v":24},{"$f":"IF($AK10>0,(VLOOKUP($B10,'Finish Times'!$A$10:$G$40,7,FALSE)),\"\")","v":42},{"$f":"IF(AK10>0,(K10+L10/60)-A$3,\" \")","v":24.7},{"$f":"IFERROR(U10,\" \")","v":23.084112149532711},3,{"$f":"IFERROR(N10-$Y$2,\"\")","v":2.9439252336448583},2.3052959501557631,{"$f":"IFERROR(ROUND((1000/Y10)-900,0),\"\")","v":326},null,"s",{"$f":"IFERROR(IF(M10>0,IF(T10=\"s\",M10*I10,0)+IF(T10=\"n\",M10*J10,0),\" \"),\"\")","v":23.084112149532711},{"$f":"IFERROR(RANK(N10,$N$10:$N$27,1),\"\")","v":3},null,null,{"$f":"IFERROR($Y$2/M10,\"\")","v":0.81539218282946779},{"$f":"IFERROR(M10*Y10,\"\")","v":20.140186915887853},null,1,3,2.9439252336448583,2.3052959501557631,null,null,55,39,null,{"$f":"(VLOOKUP($B10,'Finish Times'!$A$10:$G$40,6,FALSE))","v":24}]
{"$rows_left_out":24}
{"sheet":"Fleet 3 and 4 Combo","index":7,"n_rows":29,"n_cols":37,"rows_kept":29,"cut":false,"hidden":false,"merged":[[4,0,4,14],[6,0,6,14],[7,6,7,7],[7,8,7,9],[7,10,7,11],[5,5,5,8]]}
[null,null,null,null,null,null,null,null,null,null,null,null,null,null,null,null,null,null,6,null,null,null,null,null,"Winner"]
[null,null,null,null,null,null,null,null,null,null,null,null,null,null,null,null,null,null,null,null,null,null,null,null,{"$f":"MIN(N10:N23)","v":34.211283822682788}]
[{"$f":"'Finish Times'!B6","v":5},"<-----Minutes after first start"]
[]
["Blackwater Yacht Racing Association - Race Results Fleets 3 & 4",null,null,null,null,null,null,null,null,null,null,null,null,null,null,null,null,null,null,null,null,null,null,null,null,"Test"]
[null,null,null,"Date:",{"$f":"'Finish Times'!I4","v":"2017-09-09"},{"$f":"'Finish Times'!I5","v":"2017 Fall Series Race #2"},null,null,null,null,{"$f":"CONCATENATE(\"RC:\",\" \",'Finish Times'!I6)","v":"RC: Maloney, Tunnell"},null,null,null,null,null,null,null,null,null,null,null,null,null,"new tcf =","should ="]
[{"$f":"'Finish Times'!I7","v":"Windward / Leeward Course 1X for Fleets I and II, 1X for Fleets III and IV "},null,null,null,null,null,null,null,null,null,null,null,null,null,null,"Time","Time","Approx",null,"Finish Calculations",null,null,null,null,"Winner Adj Time","Winner Adj Time",null,null,"# of Boats"]
[null,null,null,null,null,null,"Handicap",null,"TCF",null,"Finish Time",null,"Calc(1)","Adj.(2)",null,"Behind","Behind","H'cap",null,"S for Spin",null,null,null,null,"/observed",null,null,null,{"$f":"MAX(AC10:AC23)","v":6}]
["Skipper","Boat Name","Initials","Guest?","Boat","Sail #","Spin*","Non-Spin*","Spin*","Non-Spin*","Min.","Sec.","Min.dd","Time","Place","Winner","Boat Ahead","to win",null,"N for non"]
["Perdue","Miss Virginia",null,null,"Hunter 23.5",1309,243,{"$f":"IFERROR(G10+15,\"\")","v":258},{"$f":"IF(T10 = \"s\",1000/(900+G10),\"\")","v":0.87489063867016625},{"$f":"IF(T10 =\"n\",1000/(900+H10),\"\")","v":""},{"$f":"IF($AK10>0,(VLOOKUP($B10,'Finish Times'!$A$10:$G$40,6,FALSE)),\"\")","v":""},{"$f":"IF($AK10>0,(VLOOKUP($B10,'Finish Times'!$A$10:$G$40,7,FALSE)),\"\")","v":""},{"$f":"IF(AK10>0,(K10+L10/60)-A$3,\" \")","v":" "},{"$f":"IFERROR(U10,\" \")","v":""},"",{"$f":"IFERROR(N10-$Y$2,\"\")","v":""},"",{"$f":"IFERROR(ROUND((1000/Y10)-900,0),\"\")","v":""},null,"s",{"$f":"IFERROR(IF(M10>0,IF(T10=\"s\",M10*I10,0)+IF(T10=\"n\",M10*J10,0),\" \"),\"\")","v":""},{"$f":"IFERROR(RANK(N10,$N$10:$N$23,1),\"\")","v":""},null,null,{"$f":"IFERROR($Y$2/M10,\"\")","v":""},{"$f":"IFERROR(M10*Y10,\"\")","v":""},null,1,"","","",null,null,55,39,null,{"$f":"(VLOOKUP($B10,'Finish Times'!$A$10:$G$40,6,FALSE))","v":0}]
{"$rows_left_out":19}